[Date Prev][Date Next][Thread Prev][Thread Next][Date Index][Thread Index]

[E-devel] evas directfb make error



Hi,

gcc -DHAVE_CONFIG_H -I. -I. -I../../../.. -I. -I../../../../src/lib
-I../../../../src/lib/include -I/usr/include/ freetype2 -D_REENTRANT
-I/usr/include/directfb -g -I/opt/e17/include -L/opt/e17/lib
-L/usr/X11R6/lib -L/usr/X11R6/ lib64 -MT
evas_engine_dfb_image_objects.lo -MD -MP -MF
.deps/evas_engine_dfb_image_objects.Tpo -c evas_engine_dfb_
image_objects.c -fPIC -DPIC -o .libs/evas_engine_dfb_image_objects.o
evas_engine_dfb_image_objects.c:100: error: conflicting types for
'evas_engine_directfb_image_new_from_data'
evas_engine_dfb_image_objects.h:8: error: previous declaration of
'evas_engine_directfb_image_new_from_data' was h ere
evas_engine_dfb_image_objects.c:100: error: conflicting types for
'evas_engine_directfb_image_new_from_data'
evas_engine_dfb_image_objects.h:8: error: previous declaration of
'evas_engine_directfb_image_new_from_data' was h ere
evas_engine_dfb_image_objects.c:108: error: conflicting types for
'evas_engine_directfb_image_new_from_copied_data '
evas_engine_dfb_image_objects.h:13: error: previous declaration of
'evas_engine_directfb_image_new_from_copied_dat a' was here
evas_engine_dfb_image_objects.c:108: error: conflicting types for
'evas_engine_directfb_image_new_from_copied_data '
evas_engine_dfb_image_objects.h:13: error: previous declaration of
'evas_engine_directfb_image_new_from_copied_dat a' was here
evas_engine_dfb_image_objects.c: In function
`evas_engine_directfb_image_data_put':
evas_engine_dfb_image_objects.c:238: error: too few arguments to
function `evas_engine_directfb_image_new_from_dat a'
make[5]: *** [evas_engine_dfb_image_objects.lo] Ошибка 1
make[5]: Leaving directory
`/opt/DEVEL/e17/libs/evas/src/modules/engines/directfb'
make[4]: *** [all-recursive] Ошибка 1
make[4]: Leaving directory `/opt/DEVEL/e17/libs/evas/src/modules/engines'
make[3]: *** [all-recursive] Ошибка 1
make[3]: Leaving directory `/opt/DEVEL/e17/libs/evas/src/modules'
make[2]: *** [all-recursive] Ошибка 1
make[2]: Leaving directory `/opt/DEVEL/e17/libs/evas/src'
make[1]: *** [all-recursive] Ошибка 1
make[1]: Leaving directory `/opt/DEVEL/e17/libs/evas'
make: *** [all] Ошибка 2


directfb-devel-0.9.25.1-9.rhfc3.at
directfb-0.9.25.1-9.rhfc3.at

rm -rf e17/libs/evas/src/modules/engines/directfb and update from cvs
make same error again...

Any ideas?


Thanks,
Dan