[Date Prev][Date Next][Thread Prev][Thread Next][Date Index][Thread Index]

[E-devel] problems compiling engage and evfs



Engage and Evfs failed to compile. Log attached.

--
With kind regards,
Didier.

------------
Yum/apt repository for DR17/EFL: http://sps.nus.edu.sg/~didierbe
+ umask 022
+ cd /home/didier/rpmbuild/BUILD
+ LANG=C
+ export LANG
+ unset DISPLAY
+ cd /home/didier/rpmbuild/BUILD
+ rm -rf engage-0.0.9
+ /bin/gzip -dc /home/didier/rpmbuild/SOURCES/engage-0.0.9-20060908.tar.gz
+ tar -xf -
+ STATUS=0
+ '[' 0 -ne 0 ']'
+ cd engage-0.0.9
++ /usr/bin/id -u
+ '[' 500 = 0 ']'
++ /usr/bin/id -u
+ '[' 500 = 0 ']'
+ /bin/chmod -Rf a+rX,u+w,g-w,o-w .
+ exit 0
+ umask 022
+ cd /home/didier/rpmbuild/BUILD
+ cd engage-0.0.9
+ LANG=C
+ export LANG
+ unset DISPLAY
+ rm -rf missing
+ touch README
+ aclocal -I m4
+ autoheader
+ autoconf
+ libtoolize --copy --automake
+ automake --add-missing --copy --gnu
configure.in: installing `./install-sh'
configure.in: installing `./missing'
src/Makefile.am: installing `./compile'
src/Makefile.am: installing `./depcomp'
+ CFLAGS='-O2 -g -pipe -Wall -Wp,-D_FORTIFY_SOURCE=2 -fexceptions -fstack-protec                                                             
tor --param=ssp-buffer-size=4 -m32 -march=i386 -mtune=generic -fasynchronous-unw                                                             
ind-tables'
+ export CFLAGS
+ CXXFLAGS='-O2 -g -pipe -Wall -Wp,-D_FORTIFY_SOURCE=2 -fexceptions -fstack-prot                                                             
ector --param=ssp-buffer-size=4 -m32 -march=i386 -mtune=generic -fasynchronous-u                                                             
nwind-tables'
+ export CXXFLAGS
+ FFLAGS='-O2 -g -pipe -Wall -Wp,-D_FORTIFY_SOURCE=2 -fexceptions -fstack-protec                                                             
tor --param=ssp-buffer-size=4 -m32 -march=i386 -mtune=generic -fasynchronous-unw                                                             
ind-tables'
+ export FFLAGS
++ find . -name config.guess -o -name config.sub
+ for i in '$(find . -name config.guess -o -name config.sub)'
++ basename ./config.sub
+ '[' -f /usr/lib/rpm/redhat/config.sub ']'
+ /bin/rm -f ./config.sub
++ basename ./config.sub
+ /bin/cp -fv /usr/lib/rpm/redhat/config.sub ./config.sub
+ for i in '$(find . -name config.guess -o -name config.sub)'
++ basename ./config.guess
+ '[' -f /usr/lib/rpm/redhat/config.guess ']'
+ /bin/rm -f ./config.guess
++ basename ./config.guess
+ /bin/cp -fv /usr/lib/rpm/redhat/config.guess ./config.guess
+ ./configure --build=i686-redhat-linux-gnu --host=i686-redhat-linux-gnu --targe                                                             
t=i386-redhat-linux-gnu --program-prefix= --prefix=/usr --exec-prefix=/usr --bin                                                             
dir=/usr/bin --sbindir=/usr/sbin --sysconfdir=/etc --datadir=/usr/share --includ                                                             
edir=/usr/include --libdir=/usr/lib --libexecdir=/usr/libexec --localstatedir=/v                                                             
ar --sharedstatedir=/usr/com --mandir=/usr/share/man --infodir=/usr/share/info
+ /usr/bin/make -j3
In file included from /usr/include/etk/Etk.h:22,
                 from main.c:4:
/usr/include/etk/etk_utils.h:9:1: warning: "_" redefined
In file included from e_includes.h:10,
                 from e.h:122,
                 from engage.h:12,
                 from main.c:1:
e_intl.h:6:1: warning: this is the location of the previous definition
In file included from /usr/include/etk/Etk.h:22,
                 from config_menu.c:5:
/usr/include/etk/etk_utils.h:9:1: warning: "_" redefined
In file included from e_includes.h:10,
                 from e.h:122,
                 from engage.h:12,
                 from config_menu.c:1:
e_intl.h:6:1: warning: this is the location of the previous definition
config_menu.c: In function 'od_config_menu_draw':
config_menu.c:89: warning: assignment discards qualifiers from pointer target ty                                                             
pe
config_menu.c:93: warning: assignment from incompatible pointer type
config_menu.c:86: warning: unused variable 'full'
config_menu.c:85: warning: unused variable 'len'
config_menu.c:109: warning: implicit declaration of function 'etk_menu_popup_in_                                                             
direction'
config_menu.c:109: error: 'ETK_POPUP_ABOVE_RIGHT' undeclared (first use in this                                                              
function)
config_menu.c:109: error: (Each undeclared identifier is reported only once
config_menu.c:109: error: for each function it appears in.)
make[2]: *** [engage-config_menu.o] Error 1
make[2]: *** Waiting for unfinished jobs....
make[1]: *** [all-recursive] Error 1
make: *** [all] Error 2
error: Bad exit status from /var/tmp/rpm-tmp.87344 (%build)
    Bad exit status from /var/tmp/rpm-tmp.87344 (%build)
aborting... engage.spec did not compile!
Compilation Failure!

+ umask 022
+ cd /home/didier/rpmbuild/BUILD
+ LANG=C
+ export LANG
+ unset DISPLAY
+ cd /home/didier/rpmbuild/BUILD
+ rm -rf evfs-0.0.1
+ /bin/gzip -dc /home/didier/rpmbuild/SOURCES/evfs-0.0.1-20060908.tar.gz
+ tar -xf -
+ STATUS=0
+ '[' 0 -ne 0 ']'
+ cd evfs-0.0.1
++ /usr/bin/id -u
+ '[' 500 = 0 ']'
++ /usr/bin/id -u
+ '[' 500 = 0 ']'
+ /bin/chmod -Rf a+rX,u+w,g-w,o-w .
+ exit 0
+ umask 022
+ cd /home/didier/rpmbuild/BUILD
+ cd evfs-0.0.1
+ LANG=C
+ export LANG
+ unset DISPLAY
+ rm -rf missing
+ touch README
+ aclocal -I m4
+ autoheader
+ autoconf
+ libtoolize --copy --automake
+ automake --add-missing --copy --gnu
configure.in: installing `./install-sh'
configure.in: installing `./missing'
src/bin/Makefile.am: installing `./depcomp'
src/demo/Makefile.am: installing `./compile'
+ CFLAGS='-O2 -g -pipe -Wall -Wp,-D_FORTIFY_SOURCE=2 -fexceptions -fstack-protector --param=ssp-buffer-size=4 -m32 -march=i386 -mtune=generic -fasynchronous-unwind-tables'
+ export CFLAGS
+ CXXFLAGS='-O2 -g -pipe -Wall -Wp,-D_FORTIFY_SOURCE=2 -fexceptions -fstack-protector --param=ssp-buffer-size=4 -m32 -march=i386 -mtune=generic -fasynchronous-unwind-tables'
+ export CXXFLAGS
+ FFLAGS='-O2 -g -pipe -Wall -Wp,-D_FORTIFY_SOURCE=2 -fexceptions -fstack-protector --param=ssp-buffer-size=4 -m32 -march=i386 -mtune=generic -fasynchronous-unwind-tables'
+ export FFLAGS
++ find . -name config.guess -o -name config.sub
+ for i in '$(find . -name config.guess -o -name config.sub)'
++ basename ./config.sub
+ '[' -f /usr/lib/rpm/redhat/config.sub ']'
+ /bin/rm -f ./config.sub
++ basename ./config.sub
+ /bin/cp -fv /usr/lib/rpm/redhat/config.sub ./config.sub
+ for i in '$(find . -name config.guess -o -name config.sub)'
++ basename ./config.guess
+ '[' -f /usr/lib/rpm/redhat/config.guess ']'
+ /bin/rm -f ./config.guess
++ basename ./config.guess
+ /bin/cp -fv /usr/lib/rpm/redhat/config.guess ./config.guess
+ ./configure --build=i686-redhat-linux-gnu --host=i686-redhat-linux-gnu --target=i386-redhat-linux-gnu --program-prefix= --prefix=/usr --exec-prefix=/usr --bindir=/usr/bin --sbindir=/usr/sbin --sysconfdir=/etc --datadir=/usr/share --includedir=/usr/include --libdir=/usr/lib --libexecdir=/usr/libexec --localstatedir=/var --sharedstatedir=/usr/com --mandir=/usr/share/man --infodir=/usr/share/info
configure: WARNING: Could not find all headers and libraries for extractor support: there will be fewer metadata in tooltips. cf. http://www.ovmj.org/samant
a/libextractor/ 
+ /usr/bin/make -j3
libevfs.c: In function 'evfs_tokenize_uri':
libevfs.c:281: warning: implicit declaration of function 'isalnum'
libevfs.c:281: warning: suggest parentheses around comparison in operand of |
libevfs.c:252: warning: unused variable 'c'
libevfs.c: In function 'evfs_parse_uri_single':
libevfs.c:462: warning: unused variable 'i'
libevfs.c:460: warning: unused variable 'tok'
libevfs.c:459: warning: unused variable 'pos'
libevfs.c: In function 'evfs_server_data':
libevfs.c:132: warning: control reaches end of non-void function
evfs_commands.c: In function 'evfs_client_multi_file_command':
evfs_commands.c:152: warning: unused variable 'str'
../../src/common/evfs_cleanup.c:180: warning: return type defaults to 'int'
../../src/common/evfs_cleanup.c: In function 'evfs_cleanup_event':
../../src/common/evfs_cleanup.c:209: warning: enumeration value 'EVFS_EV_REPLY' not handled in switch
../../src/common/evfs_cleanup.c:209: warning: enumeration value 'EVFS_EV_NOTIFY_ID' not handled in switch
../../src/common/evfs_cleanup.c:209: warning: enumeration value 'EVFS_EV_STAT' not handled in switch
../../src/common/evfs_cleanup.c:209: warning: enumeration value 'EVFS_EV_FILE_OPEN' not handled in switch
../../src/common/evfs_cleanup.c:209: warning: enumeration value 'EVFS_EV_PONG' not handled in switch
../../src/common/evfs_cleanup.c:209: warning: enumeration value 'EVFS_EV_METADATA_FILE_GET' not handled in switch
../../src/common/evfs_cleanup.c:209: warning: enumeration value 'EVFS_EV_ERROR' not handled in switch
../../src/common/evfs_cleanup.c:209: warning: enumeration value 'EVFS_EV_NOT_SUPPORTED' not handled in switch
../../src/common/evfs_cleanup.c: In function 'evfs_cleanup_metadata_groups_event':
../../src/common/evfs_cleanup.c:202: warning: control reaches end of non-void function
../../src/common/evfs_misc.c: In function 'evfs_filereference_equal_is':
../../src/common/evfs_misc.c:49: warning: unused variable 'p2'
../../src/common/evfs_misc.c:48: warning: unused variable 'p1'
../../src/bin/evfs_metadata.c: In function 'evfs_metadata_initialise':
../../src/bin/evfs_metadata.c:285: warning: unused variable 'tmp'
../../src/common/evfs_common.c: In function 'evfs_filereference_sanitise':
../../src/common/evfs_common.c:21: warning: control reaches end of non-void function../../src/bin/evfs_metadata.c: In function 'evfs_metadata_groups_get':
../../src/bin/evfs_metadata.c:406: warning: unused variable 'str'
../../src/bin/evfs_metadata.c: In function 'evfs_metadata_scan_runner':
../../src/bin/evfs_metadata.c:681: warning: unused variable 'tmp'

../../src/bin/evfs_metadata.c: At top level:
../../src/bin/evfs_metadata.c:124: warning: 'evfs_metadata_db_callback' defined but not used
../../src/bin/evfs_metadata_db.c: In function 'evfs_metadata_db_id_for_file':
../../src/bin/evfs_metadata_db.c:257: warning: unused variable 'errMsg'
evfs_cleanup.c: In function 'evfs_cleanup_client':
evfs_cleanup.c:4: warning: unused parameter 'client'
evfs_main.c: In function 'evfs_load_plugin_vfolder':
evfs_main.c:365: warning: initialization from incompatible pointer type
evfs_main.c:378: warning: assignment from incompatible pointer type
../../src/common/evfs_common.c: In function 'evfs_filereference_sanitise':
../../src/common/evfs_common.c:21: warning: control reaches end of non-void function
evfs_server_handle.c: In function 'evfs_handle_metadata_file_group_add':
evfs_server_handle.c:691: warning: unused parameter 'client'
evfs_server_handle.c: In function 'evfs_handle_metadata_file_group_remove':
evfs_server_handle.c:698: warning: unused parameter 'client'
evfs_operation_tasks.c: In function 'evfs_operation_tasks_mkdir_run':
evfs_operation_tasks.c:130: warning: unused parameter 'op'
evfs_operation_tasks.c: In function 'evfs_operation_tasks_file_remove_run':
evfs_operation_tasks.c:147: warning: unused parameter 'op'
evfs_operation.c: In function 'evfs_operation_run_tasks':
evfs_operation.c:402: warning: label 'OPERATION_TASK_EXIT' defined but not used
evfs_metadata_db.c: In function 'evfs_metadata_db_id_for_file':
evfs_metadata_db.c:257: warning: unused variable 'errMsg'
evfs_metadata.c: In function 'evfs_metadata_db_callback':
evfs_metadata.c:124: warning: unused parameter 'NotUsed'
evfs_metadata.c: In function 'evfs_metadata_initialise':
evfs_metadata.c:285: warning: unused variable 'tmp'
evfs_metadata.c: In function 'evfs_metadata_groups_get':
evfs_metadata.c:406: warning: unused variable 'str'
evfs_metadata.c: In function 'evfs_metadata_file_set_key_value_edd':
evfs_metadata.c:432: warning: unused parameter 'ref'
evfs_metadata.c:432: warning: unused parameter 'key'
evfs_metadata.c:433: warning: unused parameter 'value'
evfs_metadata.c:433: warning: unused parameter 'edd'
evfs_metadata.c: In function 'evfs_metadata_scan_runner':
evfs_metadata.c:681: warning: unused variable 'tmp'
evfs_metadata.c:677: warning: unused parameter 'data'
evfs_metadata.c: In function 'evfs_metadata_extract_runner':
evfs_metadata.c:733: warning: unused parameter 'data'
evfs_metadata.c: At top level:
evfs_metadata.c:124: warning: 'evfs_metadata_db_callback' defined but not used
evfscat.c: In function 'callback':
evfscat.c:27: warning: ignoring return value of 'fwrite', declared with attribute warn_unused_result
evfscat.c:7: warning: unused parameter 'obj'
evfscat.c: In function 'main':
evfscat.c:49: warning: unused variable 'pathi'
evfscopy.c: In function 'callback':
evfscopy.c:7: warning: unused parameter 'obj'
evfscopy.c: In function 'main':
evfscopy.c:33: warning: unused variable 'pathi'
evfs_fs_posix.c: In function 'evfs_client_disconnect':
evfs_fs_posix.c:125: warning: format '%d' expects type 'int', but argument 3 has type 'long unsigned int'
evfs_fs_posix.c: In function 'evfs_file_monitor_fam_handler':
evfs_fs_posix.c:172: warning: enumeration value 'ECORE_FILE_EVENT_NONE' not handled in switch
evfs_fs_posix.c:172: warning: enumeration value 'ECORE_FILE_EVENT_DELETED_SELF' not handled in switch
../../../src/common/evfs_debug.c:36: warning: 'debug_whitespace' defined but not used
../../../src/common/evfs_debug.c:45: warning: 'debug_print_thread_info' defined but not used
evfs_fs_posix.c: In function 'evfs_file_remove':
evfs_fs_posix.c:368: warning: unused variable 'i'
evfs_fs_posix.c: In function 'evfs_file_rename':
evfs_fs_posix.c:388: warning: implicit declaration of function 'evfs_misc_rename'
evfs_fs_posix.c: In function 'evfs_file_stat':
evfs_fs_posix.c:397: warning: passing argument 2 of 'stat64' from incompatible pointer type
evfs_fs_posix.c: In function 'evfs_client_disconnect':
evfs_fs_posix.c:160: warning: control reaches end of non-void function
evfs_fs_posix.c: In function 'evfs_file_monitor_fam_handler':
evfs_fs_posix.c:167: warning: 'type' may be used uninitialized in this function
../../../src/common/evfs_misc.c: In function 'evfs_filereference_equal_is':
../../../src/common/evfs_misc.c:49: warning: unused variable 'p2'
../../../src/common/evfs_misc.c:48: warning: unused variable 'p1'
evfs_fs_samba.c: In function 'evfs_client_disconnect':
evfs_fs_samba.c:71: warning: format '%d' expects type 'int', but argument 3 has type 'long unsigned int'
evfs_fs_samba.c: In function 'auth_fn':
evfs_fs_samba.c:144: warning: unused variable 'temp'
evfs_fs_samba.c: In function 'evfs_plugin_init':
evfs_fs_samba.c:173: warning: unused variable 'err'
evfs_fs_samba.c: In function 'smb_evfs_file_stat':
evfs_fs_samba.c:239: warning: unused variable 'fd'
evfs_fs_samba.c: In function 'smb_evfs_dir_list':
evfs_fs_samba.c:322: warning: suggest parentheses around assignment used as truth value
evfs_fs_samba.c:299: warning: unused variable 'dirp'
evfs_fs_samba.c:298: warning: unused variable 'dirbuf'
evfs_fs_samba.c:296: warning: unused variable 'dirc'
evfs_fs_samba.c:296: warning: unused variable 'dsize'
evfs_fs_samba.c:296: warning: unused variable 'dh3'
evfs_fs_samba.c:296: warning: unused variable 'dh2'
evfs_fs_samba.c:296: warning: unused variable 'dh1'
evfs_fs_samba.c:296: warning: unused variable 'fd'
evfs_fs_samba.c: In function 'evfs_file_remove':
evfs_fs_samba.c:434: warning: control reaches end of non-void function
evfs_fs_samba.c: In function 'smb_evfs_file_rename':
evfs_fs_samba.c:232: warning: control reaches end of non-void function
evfs_fs_samba.c: In function 'evfs_client_disconnect':
evfs_fs_samba.c:73: warning: control reaches end of non-void function
../../../src/common/evfs_debug.c:36: warning: 'debug_whitespace' defined but not used
../../../src/common/evfs_debug.c:45: warning: 'debug_print_thread_info' defined but not used
../../../src/common/evfs_misc.c: In function 'evfs_filereference_equal_is':
../../../src/common/evfs_misc.c:49: warning: unused variable 'p2'
../../../src/common/evfs_misc.c:48: warning: unused variable 'p1'
evfs_fs_tar.c: In function 'tar_checksum':
evfs_fs_tar.c:161: warning: unused variable 'parsed_sum'
evfs_fs_tar.c:160: warning: unused variable 'recorded_sum'
evfs_fs_tar.c: In function 'tar_name_split':
evfs_fs_tar.c:293: warning: suggest parentheses around assignment used as truth value
evfs_fs_tar.c:211: warning: unused variable 'fname'
evfs_fs_tar.c:209: warning: unused variable 'dir'
evfs_fs_tar.c: In function 'evfs_client_disconnect':
evfs_fs_tar.c:339: warning: format '%d' expects type 'int', but argument 3 has type 'long unsigned int'
evfs_fs_tar.c: In function 'evfs_tar_load_tar':
evfs_fs_tar.c:370: warning: passing argument 3 of 'evfs_uri_read' from incompatible pointer type
evfs_fs_tar.c:419: warning: too few arguments for format
evfs_fs_tar.c:357: warning: unused variable 'top_ref'
evfs_fs_tar.c:355: warning: unused variable 'count'
evfs_fs_tar.c:354: warning: unused variable 'key'
evfs_fs_tar.c:354: warning: unused variable 'dir'
evfs_fs_tar.c:353: warning: unused variable 'keys'
evfs_fs_tar.c:352: warning: unused variable 'ele_new'
evfs_fs_tar.c:352: warning: unused variable 'ele'
evfs_fs_tar.c:348: warning: unused variable 'parent_file'
evfs_fs_tar.c: In function 'evfs_dir_list':
evfs_fs_tar.c:448: warning: passing argument 1 of 'evfs_file_top_level_find' from incompatible pointer type
evfs_fs_tar.c: In function 'evfs_client_disconnect':
evfs_fs_tar.c:341: warning: control reaches end of non-void function
../../../src/common/evfs_debug.c:36: warning: 'debug_whitespace' defined but not used
../../../src/common/evfs_debug.c:45: warning: 'debug_print_thread_info' defined but not used
../../../src/common/evfs_common.c: In function 'evfs_filereference_sanitise':
../../../src/common/evfs_common.c:21: warning: control reaches end of non-void function
evfs_fs_bzip2.c: In function 'evfs_client_disconnect':
evfs_fs_bzip2.c:115: warning: format '%d' expects type 'int', but argument 3 has type 'long unsigned int'
evfs_fs_bzip2.c: In function 'evfs_file_read':
evfs_fs_bzip2.c:186: warning: unused variable 'r_size'
evfs_fs_bzip2.c:183: warning: unused variable 'f_par'
evfs_fs_bzip2.c: In function 'evfs_file_close':
evfs_fs_bzip2.c:239: warning: control reaches end of non-void function
evfs_fs_bzip2.c: In function 'evfs_file_read':
evfs_fs_bzip2.c:223: warning: control reaches end of non-void function
evfs_fs_bzip2.c: In function 'evfs_client_disconnect':
evfs_fs_bzip2.c:117: warning: control reaches end of non-void function
../../../src/common/evfs_debug.c:36: warning: 'debug_whitespace' defined but not used
../../../src/common/evfs_debug.c:45: warning: 'debug_print_thread_info' defined but not used
../../../src/common/evfs_common.c: In function 'evfs_filereference_sanitise':
../../../src/common/evfs_common.c:21: warning: control reaches end of non-void function
evfs_fs_ftp.c: In function 'evfs_ftp_dir_list_cb':
evfs_fs_ftp.c:204: warning: unused variable 'command'
evfs_fs_ftp.c:202: warning: unused variable 'client'
evfs_fs_ftp.c: In function 'evfs_plugin_init':
evfs_fs_ftp.c:237: warning: assignment from incompatible pointer type
evfs_fs_ftp.c:238: warning: assignment from incompatible pointer type
evfs_fs_ftp.c:230: warning: unused variable 'err'
evfs_fs_ftp.c: In function 'evfs_client_disconnect':
evfs_fs_ftp.c:365: warning: control reaches end of non-void function
../../../src/common/evfs_debug.c:36: warning: 'debug_whitespace' defined but not used
../../../src/common/evfs_debug.c:45: warning: 'debug_print_thread_info' defined but not used
evfs_fs_gzip.c: In function 'evfs_client_disconnect':
evfs_fs_gzip.c:124: warning: format '%d' expects type 'int', but argument 3 has type 'long unsigned int'
evfs_fs_gzip.c: In function 'evfs_file_open':
evfs_fs_gzip.c:259: warning: pointer targets in passing argument 3 of 'evfs_gzip_parse_header' differ in signedness
evfs_fs_gzip.c: In function 'evfs_gzip_populate_buffer':
evfs_fs_gzip.c:287: warning: pointer targets in passing argument 3 of 'evfs_uri_read' differ in signedness
evfs_fs_gzip.c: In function 'evfs_file_read':
evfs_fs_gzip.c:312: warning: unused variable 'r_size'
evfs_fs_gzip.c:309: warning: unused variable 'f_par'
evfs_fs_gzip.c: In function 'evfs_file_close':
evfs_fs_gzip.c:371: warning: control reaches end of non-void function
evfs_fs_gzip.c: In function 'evfs_file_read':
evfs_fs_gzip.c:355: warning: control reaches end of non-void function
evfs_fs_gzip.c: In function 'evfs_client_disconnect':
evfs_fs_gzip.c:126: warning: control reaches end of non-void function
../../../src/common/evfs_debug.c:36: warning: 'debug_whitespace' defined but not used
../../../src/common/evfs_debug.c:45: warning: 'debug_print_thread_info' defined but not used
../../../src/common/evfs_common.c: In function 'evfs_filereference_sanitise':
../../../src/common/evfs_common.c:21: warning: control reaches end of non-void function
../../../src/common/evfs_debug.c:36: warning: 'debug_whitespace' defined but not used
../../../src/common/evfs_debug.c:45: warning: 'debug_print_thread_info' defined but not used
evfs_fs_sftp.c: In function 'read_sftp_attr':
evfs_fs_sftp.c:122: warning: unused variable 'type'
evfs_fs_sftp.c:121: warning: unused variable 'id'
evfs_fs_sftp.c: In function 'buffer_send':
evfs_fs_sftp.c:263: warning: unused variable 'i'
evfs_fs_sftp.c:262: warning: unused variable 'c'
evfs_fs_sftp.c: In function 'buffer_write':
evfs_fs_sftp.c:315: warning: unused variable 's'
evfs_fs_sftp.c: In function 'sftp_read_names':
evfs_fs_sftp.c:586: warning: unused variable 'offset'
evfs_fs_sftp.c: In function 'sftp_exe_data':
evfs_fs_sftp.c:718: warning: 'return' with no value, in function returning non-void
evfs_fs_sftp.c:786: warning: 'return' with no value, in function returning non-void
evfs_fs_sftp.c:686: warning: unused variable 'i'
evfs_fs_sftp.c: In function 'evfs_client_disconnect':
evfs_fs_sftp.c:818: warning: format '%d' expects type 'int', but argument 3 has type 'long unsigned int'
evfs_fs_sftp.c: In function 'evfs_plugin_init':
evfs_fs_sftp.c:826: warning: unused variable 'err'
evfs_fs_sftp.c: In function 'evfs_file_stat':
evfs_fs_sftp.c:890: warning: unused variable 'rid'
evfs_fs_sftp.c: In function 'evfs_file_read':
evfs_fs_sftp.c:933: warning: unused variable 'rid'
evfs_fs_sftp.c: In function 'evfs_file_close':
evfs_fs_sftp.c:1062: warning: implicit declaration of function 'sftp_file_close'
evfs_fs_sftp.c:1062: warning: assignment makes pointer from integer without a cast
evfs_fs_sftp.c:1039: warning: unused variable 'rid'
evfs_fs_sftp.c: In function 'evfs_file_read':
evfs_fs_sftp.c:983: warning: control reaches end of non-void function
evfs_fs_sftp.c: In function 'evfs_client_disconnect':
evfs_fs_sftp.c:820: warning: control reaches end of non-void function
../../../src/common/evfs_common.c: In function 'evfs_filereference_sanitise':
../../../src/common/evfs_common.c:21: warning: control reaches end of non-void function
evfs_fs_vfolder.c: In function 'evfs_client_disconnect':
evfs_fs_vfolder.c:132: warning: format '%d' expects type 'int', but argument 3 has type 'long unsigned int'
evfs_fs_vfolder.c:135: warning: control reaches end of non-void function
../../../src/common/evfs_debug.c:36: warning: 'debug_whitespace' defined but not used
../../../src/common/evfs_debug.c:45: warning: 'debug_print_thread_info' defined but not used
evfs_fs_trash.c: In function 'evfs_fs_trash_filename_get':
evfs_fs_trash.c:129: warning: format '%d' expects type 'int', but argument 7 has type 'time_t'
evfs_fs_trash.c: In function 'evfs_fs_trash_infofile_create':
evfs_fs_trash.c:150: warning: suggest parentheses around assignment used as truth value
evfs_fs_trash.c: In function 'evfs_client_disconnect':
evfs_fs_trash.c:211: warning: format '%d' expects type 'int', but argument 3 has type 'long unsigned int'
evfs_fs_trash.c: In function 'evfs_file_stat':
evfs_fs_trash.c:224: warning: value computed is not used
evfs_fs_trash.c: In function 'evfs_file_create':
evfs_fs_trash.c:327: warning: unused variable 'fd'
evfs_fs_trash.c: In function 'evfs_file_mkdir':
evfs_fs_trash.c:410: warning: control reaches end of non-void function
evfs_fs_trash.c: In function 'evfs_file_write':
evfs_fs_trash.c:305: warning: control reaches end of non-void function
evfs_fs_trash.c: In function 'evfs_client_disconnect':
evfs_fs_trash.c:213: warning: control reaches end of non-void function
../../../src/common/evfs_misc.c: In function 'evfs_filereference_equal_is':
../../../src/common/evfs_misc.c:49: warning: unused variable 'p2'
../../../src/common/evfs_misc.c:48: warning: unused variable 'p1'
../../../src/common/evfs_debug.c:36: warning: 'debug_whitespace' defined but not used
../../../src/common/evfs_debug.c:45: warning: 'debug_print_thread_info' defined but not used
../../../src/common/evfs_misc.c: In function 'evfs_filereference_equal_is':
../../../src/common/evfs_misc.c:49: warning: unused variable 'p2'
../../../src/common/evfs_misc.c:48: warning: unused variable 'p1'
grep: /usr/lib/libecore_fb.la: No such file or directory
/bin/sed: can't read /usr/lib/libecore_fb.la: No such file or directory
libtool: link: `/usr/lib/libecore_fb.la' is not a valid libtool archive
make[4]: *** [posix.la] Error 1
make[4]: *** Waiting for unfinished jobs....
grep: /usr/lib/libecore_fb.la: No such file or directory
/bin/sed: can't read /usr/lib/libecore_fb.la: No such file or directory
libtool: link: `/usr/lib/libecore_fb.la' is not a valid libtool archive
make[4]: *** [samba.la] Error 1
grep: /usr/lib/libecore_fb.la: No such file or directory
/bin/sed: can't read /usr/lib/libecore_fb.la: No such file or directory
libtool: link: `/usr/lib/libecore_fb.la' is not a valid libtool archive
make[4]: *** [tar.la] Error 1
make[3]: *** [all-recursive] Error 1
make[2]: *** [all-recursive] Error 1
make[1]: *** [all-recursive] Error 1
make: *** [all] Error 2
error: Bad exit status from /var/tmp/rpm-tmp.74191 (%build)
    Bad exit status from /var/tmp/rpm-tmp.74191 (%build)
aborting... evfs.spec did not compile!
Compilation Failure!