[Date Prev][Date Next][Thread Prev][Thread Next][Date Index][Thread Index]

[E-devel] Engage in CVS failed to compile



Damn now it's engage who refuses to compile. This time all the
libraries are in (double checked!).
Log attached.

--
With kind regards,
Didier.

------------
Yum/apt repository for DR17/EFL: http://sps.nus.edu.sg/~didierbe
+ umask 022
+ cd /home/didier/rpmbuild/BUILD
+ LANG=C
+ export LANG
+ unset DISPLAY
+ cd /home/didier/rpmbuild/BUILD
+ rm -rf engage-0.0.9
+ /bin/gzip -dc /home/didier/rpmbuild/SOURCES/engage-0.0.9-20060820.tar.gz
+ tar -xf -
+ STATUS=0
+ '[' 0 -ne 0 ']'
+ cd engage-0.0.9
++ /usr/bin/id -u
+ '[' 500 = 0 ']'
++ /usr/bin/id -u
+ '[' 500 = 0 ']'
+ /bin/chmod -Rf a+rX,u+w,g-w,o-w .
+ exit 0
+ umask 022
+ cd /home/didier/rpmbuild/BUILD
+ cd engage-0.0.9
+ LANG=C
+ export LANG
+ unset DISPLAY
+ rm -rf missing
+ touch README
+ aclocal -I m4
+ autoheader
+ autoconf
+ libtoolize --copy --automake
+ automake --add-missing --copy --gnu
configure.in: installing `./install-sh'
configure.in: installing `./missing'
src/Makefile.am: installing `./compile'
src/Makefile.am: installing `./depcomp'
+ CFLAGS='-O2 -g -pipe -Wall -Wp,-D_FORTIFY_SOURCE=2 -fexceptions -fstack-protec
tor --param=ssp-buffer-size=4 -m32 -march=i386 -mtune=generic -fasynchronous-unw
ind-tables'
+ export CFLAGS
+ CXXFLAGS='-O2 -g -pipe -Wall -Wp,-D_FORTIFY_SOURCE=2 -fexceptions -fstack-prot
ector --param=ssp-buffer-size=4 -m32 -march=i386 -mtune=generic -fasynchronous-u
nwind-tables'
+ export CXXFLAGS
+ FFLAGS='-O2 -g -pipe -Wall -Wp,-D_FORTIFY_SOURCE=2 -fexceptions -fstack-protec
tor --param=ssp-buffer-size=4 -m32 -march=i386 -mtune=generic -fasynchronous-unw
ind-tables'
+ export FFLAGS
++ find . -name config.guess -o -name config.sub
+ for i in '$(find . -name config.guess -o -name config.sub)'
++ basename ./config.sub
+ '[' -f /usr/lib/rpm/redhat/config.sub ']'
+ /bin/rm -f ./config.sub
++ basename ./config.sub
+ /bin/cp -fv /usr/lib/rpm/redhat/config.sub ./config.sub
+ for i in '$(find . -name config.guess -o -name config.sub)'
++ basename ./config.guess
+ '[' -f /usr/lib/rpm/redhat/config.guess ']'
+ /bin/rm -f ./config.guess
++ basename ./config.guess
+ /bin/cp -fv /usr/lib/rpm/redhat/config.guess ./config.guess
+ ./configure --build=i686-redhat-linux-gnu --host=i686-redhat-linux-gnu --targe
t=i386-redhat-linux-gnu --program-prefix= --prefix=/usr --exec-prefix=/usr --bin
dir=/usr/bin --sbindir=/usr/sbin --sysconfdir=/etc --datadir=/usr/share --includ
edir=/usr/include --libdir=/usr/lib --libexecdir=/usr/libexec --localstatedir=/v
ar --sharedstatedir=/usr/com --mandir=/usr/share/man --infodir=/usr/share/info
./configure: line 21918: test: : integer expression expected
+ /usr/bin/make -j3
In file included from e_mod_main.c:5:
e_mod_main.h:88: error: expected specifier-qualifier-list before 'E_Gadman_Clien
t'
e_mod_main.c:70: error: expected declaration specifiers or '...' before 'E_Gadma
n_Client'
e_mod_main.c:70: error: expected declaration specifiers or '...' before 'E_Gadma
n_Change'
e_mod_main.c: In function '_engage_new':
e_mod_main.c:319: error: 'Engage_Bar' has no member named 'conf'
e_mod_main.c:320: error: 'Engage_Bar' has no member named 'conf'
e_mod_main.c:321: error: 'Engage_Bar' has no member named 'conf'
e_mod_main.c:322: error: 'Engage_Bar' has no member named 'conf'
e_mod_main.c:323: error: 'Engage_Bar' has no member named 'conf'
e_mod_main.c:324: error: 'Engage_Bar' has no member named 'conf'
e_mod_main.c:325: error: 'Engage_Bar' has no member named 'conf'
e_mod_main.c:326: error: 'Engage_Bar' has no member named 'conf'
e_mod_main.c:327: error: 'Engage_Bar' has no member named 'conf'
e_mod_main.c:331: error: 'Engage_Bar' has no member named 'conf'
e_mod_main.c:334: error: 'Engage_Bar' has no member named 'conf'
e_mod_main.c:334: error: 'Engage_Bar' has no member named 'conf'
e_mod_main.c:334: error: 'Engage_Bar' has no member named 'conf'
e_mod_main.c:334: error: 'Engage_Bar' has no member named 'conf'
e_mod_main.c:335: error: 'Engage_Bar' has no member named 'conf'
e_mod_main.c:335: error: 'Engage_Bar' has no member named 'conf'
e_mod_main.c:335: error: 'Engage_Bar' has no member named 'conf'
e_mod_main.c:335: error: 'Engage_Bar' has no member named 'conf'
e_mod_main.c:336: error: 'Engage_Bar' has no member named 'conf'
e_mod_main.c:336: error: 'Engage_Bar' has no member named 'conf'
e_mod_main.c:336: error: 'Engage_Bar' has no member named 'conf'
e_mod_main.c:336: error: 'Engage_Bar' has no member named 'conf'
e_mod_main.c:337: error: 'Engage_Bar' has no member named 'conf'
e_mod_main.c:337: error: 'Engage_Bar' has no member named 'conf'
e_mod_main.c:337: error: 'Engage_Bar' has no member named 'conf'
e_mod_main.c:337: error: 'Engage_Bar' has no member named 'conf'
e_mod_main.c:338: error: 'Engage_Bar' has no member named 'conf'
e_mod_main.c:338: error: 'Engage_Bar' has no member named 'conf'
e_mod_main.c:338: error: 'Engage_Bar' has no member named 'conf'
e_mod_main.c:338: error: 'Engage_Bar' has no member named 'conf'
e_mod_main.c:339: error: 'Engage_Bar' has no member named 'conf'
e_mod_main.c:339: error: 'Engage_Bar' has no member named 'conf'
e_mod_main.c:339: error: 'Engage_Bar' has no member named 'conf'
e_mod_main.c:339: error: 'Engage_Bar' has no member named 'conf'
e_mod_main.c:363: error: 'Engage_Bar' has no member named 'conf'
e_mod_main.c: In function '_engage_bar_new':
e_mod_main.c:615: error: 'E_Gadman_Policy' undeclared (first use in this functio
n)
e_mod_main.c:615: error: (Each undeclared identifier is reported only once
e_mod_main.c:615: error: for each function it appears in.)
e_mod_main.c:615: error: expected ';' before 'policy'
e_mod_main.c:624: error: 'Engage_Bar' has no member named 'tray'
e_mod_main.c:625: error: 'Engage_Bar' has no member named 'selected_ic'
e_mod_main.c:684: error: 'Engage_Bar' has no member named 'gmc'
e_mod_main.c:684: warning: implicit declaration of function 'e_gadman_client_new
'
e_mod_main.c:684: error: 'E_Container' has no member named 'gadman'
e_mod_main.c:685: warning: implicit declaration of function 'e_gadman_client_dom
ain_set'
e_mod_main.c:685: error: 'Engage_Bar' has no member named 'gmc'
e_mod_main.c:686: error: 'policy' undeclared (first use in this function)
e_mod_main.c:686: error: 'E_GADMAN_POLICY_EDGES' undeclared (first use in this f
unction)
e_mod_main.c:686: error: 'E_GADMAN_POLICY_HMOVE' undeclared (first use in this f
unction)
e_mod_main.c:686: error: 'E_GADMAN_POLICY_VMOVE' undeclared (first use in this f
unction)
e_mod_main.c:687: warning: implicit declaration of function 'e_gadman_client_pol
icy_set'
e_mod_main.c:687: error: 'Engage_Bar' has no member named 'gmc'
e_mod_main.c:688: warning: implicit declaration of function 'e_gadman_client_min
_size_set'
e_mod_main.c:688: error: 'Engage_Bar' has no member named 'gmc'
e_mod_main.c:689: warning: implicit declaration of function 'e_gadman_client_max
_size_set'
e_mod_main.c:689: error: 'Engage_Bar' has no member named 'gmc'
e_mod_main.c:690: warning: implicit declaration of function 'e_gadman_client_aut
o_size_set'
e_mod_main.c:690: error: 'Engage_Bar' has no member named 'gmc'
e_mod_main.c:691: warning: implicit declaration of function 'e_gadman_client_ali
gn_set'
e_mod_main.c:691: error: 'Engage_Bar' has no member named 'gmc'
e_mod_main.c:692: warning: implicit declaration of function 'e_gadman_client_res
ize'
e_mod_main.c:692: error: 'Engage_Bar' has no member named 'gmc'
e_mod_main.c:693: warning: implicit declaration of function 'e_gadman_client_edg
e_set'
e_mod_main.c:693: error: 'Engage_Bar' has no member named 'gmc'
e_mod_main.c:693: error: 'E_GADMAN_EDGE_BOTTOM' undeclared (first use in this fu
nction)
e_mod_main.c:694: warning: implicit declaration of function 'e_gadman_client_cha
nge_func_set'
e_mod_main.c:694: error: 'Engage_Bar' has no member named 'gmc'
e_mod_main.c:695: warning: implicit declaration of function 'e_gadman_client_loa
d'
e_mod_main.c:695: error: 'Engage_Bar' has no member named 'gmc'
e_mod_main.c:706: error: 'Engage_Bar' has no member named 'add_handler'
e_mod_main.c:708: error: 'Engage_Bar' has no member named 'remove_handler'
e_mod_main.c:710: error: 'Engage_Bar' has no member named 'iconify_handler'
e_mod_main.c:712: error: 'Engage_Bar' has no member named 'uniconify_handler'
e_mod_main.c: In function '_engage_bar_free':
e_mod_main.c:777: warning: implicit declaration of function 'e_gadman_client_sav
e'
e_mod_main.c:777: error: 'Engage_Bar' has no member named 'gmc'
e_mod_main.c:778: error: 'Engage_Bar' has no member named 'gmc'
e_mod_main.c:782: error: 'Engage_Bar' has no member named 'add_handler'
e_mod_main.c:783: error: 'Engage_Bar' has no member named 'remove_handler'
e_mod_main.c:784: error: 'Engage_Bar' has no member named 'iconify_handler'
e_mod_main.c:785: error: 'Engage_Bar' has no member named 'uniconify_handler'
e_mod_main.c:787: error: 'Engage_Bar' has no member named 'cfd'
e_mod_main.c:789: error: 'Engage_Bar' has no member named 'cfd'
e_mod_main.c:790: error: 'Engage_Bar' has no member named 'cfd'
e_mod_main.c:792: error: 'Engage_Bar' has no member named 'conf'
e_mod_main.c: In function '_engage_bar_menu_gen':
e_mod_main.c:842: error: 'Engage_Bar' has no member named 'selected_ic'
e_mod_main.c:848: error: 'Engage_Bar' has no member named 'selected_ic'
e_mod_main.c:868: error: 'Engage_Bar' has no member named 'conf'
e_mod_main.c:886: error: 'Engage_Bar' has no member named 'conf'
e_mod_main.c:894: error: 'Engage_Bar' has no member named 'conf'
e_mod_main.c:901: error: 'Engage_Bar' has no member named 'selected_ic'
e_mod_main.c:901: error: 'Engage_Bar' has no member named 'selected_ic'
e_mod_main.c:906: error: 'Engage_Bar' has no member named 'selected_ic'
e_mod_main.c:907: error: 'Engage_Bar' has no member named 'selected_ic'
e_mod_main.c:917: error: 'Engage_Bar' has no member named 'conf'
e_mod_main.c: In function '_engage_bar_enable':
e_mod_main.c:962: error: 'Engage_Bar' has no member named 'conf'
e_mod_main.c:966: error: 'Engage_Bar' has no member named 'conf'
e_mod_main.c: In function '_engage_bar_disable':
e_mod_main.c:973: error: 'Engage_Bar' has no member named 'conf'
e_mod_main.c: In function '_engage_icon_new':
e_mod_main.c:1010: error: 'Engage_Bar' has no member named 'conf'
e_mod_main.c:1032: error: 'Engage_Bar' has no member named 'gmc'
e_mod_main.c:1035: warning: implicit declaration of function 'e_gadman_client_ed
ge_get'
e_mod_main.c:1035: error: 'Engage_Bar' has no member named 'gmc'
e_mod_main.c: In function '_engage_app_icon_new':
e_mod_main.c:1126: error: 'Engage_Bar' has no member named 'conf'
e_mod_main.c:1126: error: 'Engage_Bar' has no member named 'conf'
e_mod_main.c: In function '_engage_cb_event_dnd_position':
e_mod_main.c:1219: warning: implicit declaration of function 'e_gadman_client_ge
ometry_get'
e_mod_main.c:1219: error: 'Engage_Bar' has no member named 'gmc'
e_mod_main.c: In function '_engage_bar_layout':
e_mod_main.c:1524: error: 'Engage_Bar' has no member named 'gmc'
e_mod_main.c:1526: error: 'Engage_Bar' has no member named 'gmc'
e_mod_main.c:1533: error: 'Engage_Bar' has no member named 'conf'
e_mod_main.c:1533: error: 'Engage_Bar' has no member named 'conf'
e_mod_main.c:1535: error: 'E_GADMAN_EDGE_LEFT' undeclared (first use in this fun
ction)
e_mod_main.c:1535: error: 'E_GADMAN_EDGE_RIGHT' undeclared (first use in this fu
nction)In file included from e_mod_config.c:2:
e_mod_main.h:88: error: expected specifier-qualifier-list before 'E_Gadman_Clien
t'

e_mod_main.c:1536: error: 'Engage_Bar' has no member named 'conf'
e_mod_main.c:1538: error: 'Engage_Bar' has no member named 'conf'
e_mod_main.c: In function '_engage_bar_frame_resize':
e_mod_main.c:1554: error: 'Engage_Bar' has no member named 'gmc'
e_mod_main.c:1555: error: 'E_GADMAN_EDGE_LEFT' undeclared (first use in this fun
ction)e_mod_config.c: In function '_engage_module_config':

e_mod_main.c:1555: error: 'E_GADMAN_EDGE_RIGHT' undeclared (first use in this fu
nction)
e_mod_main.c:1557: error: 'Engage_Bar' has no member named 'conf'
e_mod_config.c:32: error: 'Engage_Bar' has no member named 'cfd'
e_mod_main.c:1558: error: 'Engage_Bar' has no member named 'conf'
e_mod_main.c:1562: error: 'Engage_Bar' has no member named 'conf'
e_mod_main.c:1563: error: 'Engage_Bar' has no member named 'conf'
e_mod_config.c:49: error: 'Engage_Bar' has no member named 'cfd'
e_mod_main.c:1575: error: 'Engage_Bar' has no member named 'gmc'
e_mod_config.c: In function '_fill_data':
e_mod_config.c:58: error: 'Engage_Bar' has no member named 'conf'
e_mod_config.c:59: error: 'Engage_Bar' has no member named 'conf'
e_mod_config.c:61: error: 'Engage_Bar' has no member named 'conf'
e_mod_config.c:62: error: 'Engage_Bar' has no member named 'conf'
e_mod_config.c:63: error: 'Engage_Bar' has no member named 'conf'
e_mod_config.c:64: error: 'Engage_Bar' has no member named 'conf'
e_mod_config.c:66: error: 'Engage_Bar' has no member named 'conf'
e_mod_main.c: In function '_engage_bar_edge_change':e_mod_config.c: In function 
'_free_data':
e_mod_config.c:90: error: 'Engage_Bar' has no member named 'cfd'

e_mod_main.c:1587: error: 'E_Gadman_Policy' undeclared (first use in this functi
on)
e_mod_main.c:1587: error: expected ';' before 'policy'
e_mod_main.c:1595: error: 'Engage_Bar' has no member named 'tray'
e_mod_main.c:1596: error: 'Engage_Bar' has no member named 'tray'
e_mod_main.c:1600: error: 'Engage_Bar' has no member named 'tray'
e_mod_main.c:1601: error: 'Engage_Bar' has no member named 'tray'
e_mod_config.c: In function '_basic_apply_data':
e_mod_config.c:143: error: 'Engage_Bar' has no member named 'conf'
e_mod_config.c:144: error: 'Engage_Bar' has no member named 'conf'
e_mod_config.c:146: error: 'Engage_Bar' has no member named 'conf'
e_mod_config.c:147: error: 'Engage_Bar' has no member named 'conf'
e_mod_config.c:149: error: 'Engage_Bar' has no member named 'conf'
e_mod_main.c:1619: error: 'policy' undeclared (first use in this function)
e_mod_main.c:1619: error: 'E_GADMAN_POLICY_EDGES' undeclared (first use in this 
function)
e_mod_main.c:1619: error: 'E_GADMAN_POLICY_HMOVE' undeclared (first use in this 
function)
e_mod_main.c:1619: error: 'E_GADMAN_POLICY_VMOVE' undeclared (first use in this 
function)
e_mod_main.c:1620: error: 'E_GADMAN_EDGE_BOTTOM' undeclared (first use in this f
unction)
e_mod_main.c:1621: error: 'E_GADMAN_EDGE_TOP' undeclared (first use in this func
tion)
e_mod_main.c:1623: error: 'E_GADMAN_POLICY_VSIZE' undeclared (first use in this 
function)
e_mod_main.c:1624: error: 'Engage_Bar' has no member named 'gmc'
e_mod_main.c:1631: error: 'E_GADMAN_EDGE_LEFT' undeclared (first use in this fun
ction)
e_mod_main.c:1632: error: 'E_GADMAN_EDGE_RIGHT' undeclared (first use in this fu
nction)
e_mod_main.c:1634: error: 'E_GADMAN_POLICY_HSIZE' undeclared (first use in this 
function)
e_mod_main.c:1635: error: 'Engage_Bar' has no member named 'gmc'
e_mod_config.c: In function '_advanced_apply_data':
e_mod_config.c:210: error: 'Engage_Bar' has no member named 'conf'
e_mod_config.c:211: error: 'Engage_Bar' has no member named 'conf'
e_mod_config.c:213: error: 'Engage_Bar' has no member named 'conf'
e_mod_main.c: In function '_engage_bar_update_policy':
e_mod_main.c:1651: error: 'E_Gadman_Policy' undeclared (first use in this functi
on)
e_mod_main.c:1651: error: expected ';' before 'policy'
e_mod_main.c:1653: error: 'policy' undeclared (first use in this function)
e_mod_main.c:1653: error: 'E_GADMAN_POLICY_EDGES' undeclared (first use in this 
function)
e_mod_main.c:1653: error: 'E_GADMAN_POLICY_HMOVE' undeclared (first use in this 
function)
e_mod_main.c:1653: error: 'E_GADMAN_POLICY_VMOVE' undeclared (first use in this 
function)
e_mod_main.c:1654: error: 'Engage_Bar' has no member named 'gmc'
e_mod_main.c:1654: error: 'E_GADMAN_EDGE_BOTTOM' undeclared (first use in this f
unction)
e_mod_main.c:1655: error: 'Engage_Bar' has no member named 'gmc'
e_mod_main.c:1655: error: 'E_GADMAN_EDGE_TOP' undeclared (first use in this func
tion)
e_mod_main.c:1657: error: 'E_GADMAN_POLICY_VSIZE' undeclared (first use in this 
function)
e_mod_main.c:1658: error: 'Engage_Bar' has no member named 'gmc'
e_mod_main.c:1660: error: 'Engage_Bar' has no member named 'gmc'
e_mod_main.c:1660: error: 'E_GADMAN_EDGE_LEFT' undeclared (first use in this fun
ction)
e_mod_main.c:1661: error: 'Engage_Bar' has no member named 'gmc'
e_mod_main.c:1661: error: 'E_GADMAN_EDGE_RIGHT' undeclared (first use in this fu
nction)
e_mod_main.c:1663: error: 'E_GADMAN_POLICY_HSIZE' undeclared (first use in this 
function)
e_mod_main.c:1664: error: 'Engage_Bar' has no member named 'gmc'
e_mod_main.c: In function '_engage_bar_motion_handle':
e_mod_main.c:1676: error: 'E_Gadman_Edge' undeclared (first use in this function
)
e_mod_main.c:1676: error: expected ';' before 'edge'
e_mod_main.c:1693: error: 'edge' undeclared (first use in this function)
e_mod_main.c:1693: error: 'Engage_Bar' has no member named 'gmc'
e_mod_main.c:1694: error: 'E_GADMAN_EDGE_LEFT' undeclared (first use in this fun
ction)
e_mod_main.c:1694: error: 'E_GADMAN_EDGE_RIGHT' undeclared (first use in this fu
nction)
e_mod_main.c:1711: error: 'E_GADMAN_EDGE_TOP' undeclared (first use in this func
tion)
e_mod_main.c:1717: error: 'Engage_Bar' has no member named 'conf'
e_mod_main.c:1719: error: 'Engage_Bar' has no member named 'conf'
e_mod_main.c:1731: error: 'Engage_Bar' has no member named 'conf'
e_mod_main.c:1733: error: 'Engage_Bar' has no member named 'conf'
e_mod_main.c:1736: error: 'Engage_Bar' has no member named 'conf'
e_mod_main.c:1745: error: 'Engage_Bar' has no member named 'conf'
e_mod_main.c:1923: error: 'Engage_Bar' has no member named 'conf'
e_mod_main.c: In function '_engage_bar_zoom_factor_set':
e_mod_main.c:1931: error: 'Engage_Bar' has no member named 'conf'
e_mod_main.c: In function '_engage_bar_zoom_duration_set':
e_mod_main.c:1938: error: 'Engage_Bar' has no member named 'conf'
e_mod_main.c: In function '_engage_bar_cb_intercept_resize':
e_mod_main.c:2017: error: 'E_Gadman_Edge' undeclared (first use in this function
)
e_mod_main.c:2017: error: expected ';' before 'edge'
e_mod_main.c:2027: error: 'Engage_Bar' has no member named 'gmc'
e_mod_main.c:2028: error: 'edge' undeclared (first use in this function)
e_mod_main.c:2028: error: 'Engage_Bar' has no member named 'gmc'
e_mod_main.c:2030: error: 'E_GADMAN_EDGE_BOTTOM' undeclared (first use in this f
unction)
e_mod_main.c: In function '_engage_icon_cb_mouse_down':
e_mod_main.c:2128: error: 'Engage_Bar' has no member named 'gmc'
e_mod_main.c:2132: error: 'Engage_Bar' has no member named 'selected_ic'
e_mod_config.c:214: error: 'Engage_Bar' has no member named 'conf'
e_mod_config.c:215: error: 'Engage_Bar' has no member named 'conf'
e_mod_config.c:216: error: 'Engage_Bar' has no member named 'conf'
e_mod_config.c:218: error: 'Engage_Bar' has no member named 'conf'
e_mod_main.c: In function '_engage_bar_cb_mouse_in':
e_mod_main.c:2213: error: 'E_Gadman_Edge' undeclared (first use in this function
)
e_mod_main.c:2213: error: expected ';' before 'edge'
e_mod_main.c:2224: error: 'edge' undeclared (first use in this function)
e_mod_main.c:2224: error: 'Engage_Bar' has no member named 'gmc'
e_mod_main.c:2226: error: 'Engage_Bar' has no member named 'conf'
e_mod_main.c:2227: error: 'Engage_Bar' has no member named 'conf'
e_mod_main.c:2227: error: 'Engage_Bar' has no member named 'conf'
e_mod_main.c:2233: error: 'E_GADMAN_EDGE_LEFT' undeclared (first use in this fun
ction)
e_mod_main.c:2237: error: 'E_GADMAN_EDGE_RIGHT' undeclared (first use in this fu
nction)
e_mod_main.c:2242: error: 'E_GADMAN_EDGE_TOP' undeclared (first use in this func
tion)
e_mod_main.c: In function '_engage_zoom_in_slave':
e_mod_main.c:2294: error: 'Engage_Bar' has no member named 'conf'
e_mod_main.c:2294: error: 'Engage_Bar' has no member named 'conf'
e_mod_main.c:2297: error: 'Engage_Bar' has no member named 'conf'
e_mod_main.c:2299: error: 'Engage_Bar' has no member named 'conf'
e_mod_main.c:2302: error: 'Engage_Bar' has no member named 'conf'
e_mod_main.c:2304: error: 'Engage_Bar' has no member named 'conf'
e_mod_main.c: In function '_engage_zoom_out_slave':
e_mod_main.c:2334: error: 'Engage_Bar' has no member named 'conf'
e_mod_main.c:2335: error: 'Engage_Bar' has no member named 'conf'
e_mod_main.c:2335: error: 'Engage_Bar' has no member named 'conf'
e_mod_main.c:2338: error: 'Engage_Bar' has no member named 'conf'
e_mod_main.c:2339: error: 'Engage_Bar' has no member named 'conf'
e_mod_main.c: At top level:
e_mod_main.c:2400: error: expected declaration specifiers or '...' before 'E_Gad
man_Client'
e_mod_main.c:2400: error: expected declaration specifiers or '...' before 'E_Gad
man_Change'
e_mod_main.c: In function '_engage_bar_cb_gmc_change':
e_mod_main.c:2406: error: 'change' undeclared (first use in this function)
e_mod_main.c:2408: error: 'E_GADMAN_CHANGE_MOVE_RESIZE' undeclared (first use in
 this function)
e_mod_main.c:2409: error: 'Engage_Bar' has no member named 'gmc'
e_mod_main.c:2411: error: 'Engage_Bar' has no member named 'gmc'
e_mod_main.c:2412: error: 'E_GADMAN_EDGE_TOP' undeclared (first use in this func
tion)
e_mod_main.c:2412: error: 'E_GADMAN_EDGE_BOTTOM' undeclared (first use in this f
unction)
e_mod_main.c:2413: error: 'Engage_Bar' has no member named 'conf'
e_mod_main.c:2415: error: 'Engage_Bar' has no member named 'conf'
e_mod_main.c:2421: error: 'E_GADMAN_CHANGE_EDGE' undeclared (first use in this f
unction)
e_mod_main.c:2422: error: 'Engage_Bar' has no member named 'gmc'
e_mod_main.c:2424: error: 'E_GADMAN_CHANGE_RAISE' undeclared (first use in this 
function)
e_mod_main.c:2425: error: 'E_GADMAN_CHANGE_ZONE' undeclared (first use in this f
unction)
e_mod_main.c: In function '_engage_bar_cb_menu_enabled':
e_mod_main.c:2441: error: 'Engage_Bar' has no member named 'conf'
e_mod_main.c:2445: error: 'Engage_Bar' has no member named 'conf'
e_mod_main.c: In function '_engage_bar_cb_menu_edit':
e_mod_main.c:2457: warning: implicit declaration of function 'e_gadman_mode_set'
e_mod_main.c:2457: error: 'Engage_Bar' has no member named 'gmc'
e_mod_main.c:2457: error: 'E_GADMAN_MODE_EDIT' undeclared (first use in this fun
ction)
e_mod_main.c: In function '_engage_bar_cb_menu_zoom':
e_mod_main.c:2477: error: 'Engage_Bar' has no member named 'conf'
e_mod_main.c: In function '_engage_bar_cb_menu_zoom_stretch':
e_mod_main.c:2487: error: 'Engage_Bar' has no member named 'conf'
e_mod_main.c: In function '_engage_bar_cb_menu_tray':
e_mod_main.c:2498: error: 'Engage_Bar' has no member named 'conf'
e_mod_main.c: In function '_engage_bar_cb_menu_edit_icon':
e_mod_main.c:2511: error: 'Engage_Bar' has no member named 'selected_ic'
e_mod_main.c: In function '_engage_bar_cb_menu_keep_icon':
e_mod_main.c:2521: error: 'Engage_Bar' has no member named 'selected_ic'
e_mod_main.c: In function '_engage_bar_cb_menu_remove_icon':
e_mod_main.c:2532: error: 'Engage_Bar' has no member named 'selected_ic'
e_mod_main.c: In function '_engage_bar_cb_menu_context_change':
e_mod_main.c:2557: warning: ignoring return value of 'link', declared with attri
bute warn_unused_result
e_mod_main.c: In function '_engage_zoom_function':
e_mod_main.c:2635: error: 'Engage_Bar' has no member named 'conf'
e_mod_main.c:2651: error: 'Engage_Bar' has no member named 'conf'
e_mod_main.c:2653: error: 'Engage_Bar' has no member named 'conf'
e_mod_main.c:2660: error: 'Engage_Bar' has no member named 'conf'
e_mod_main.c:2663: error: 'Engage_Bar' has no member named 'conf'
e_mod_main.c:2665: error: 'Engage_Bar' has no member named 'conf'
e_mod_main.c:2666: error: 'Engage_Bar' has no member named 'conf'
e_mod_main.c:2672: error: 'Engage_Bar' has no member named 'conf'
e_mod_main.c:2674: error: 'Engage_Bar' has no member named 'conf'
e_mod_main.c:2675: error: 'Engage_Bar' has no member named 'conf'
e_mod_main.c: In function '_engage_border_ignore':
e_mod_main.c:2696: warning: value computed is not used
make[3]: *** [e_mod_main.lo] Error 1
make[3]: *** Waiting for unfinished jobs....
make[3]: *** [e_mod_config.lo] Error 1
In file included from tray.c:2:
e_mod_main.h:88: error: expected specifier-qualifier-list before 'E_Gadman_Clien
t'
tray.c: In function '_engage_tray_init':
tray.c:30: error: 'Engage_Bar' has no member named 'tray'
tray.c:31: error: 'Engage_Bar' has no member named 'tray'
tray.c:32: error: 'Engage_Bar' has no member named 'tray'
tray.c:33: error: 'Engage_Bar' has no member named 'tray'
tray.c:34: error: 'Engage_Bar' has no member named 'tray'
tray.c:36: error: 'Engage_Bar' has no member named 'tray'
tray.c:38: error: 'Engage_Bar' has no member named 'tray'
tray.c:39: error: 'Engage_Bar' has no member named 'tray'
tray.c:40: error: 'Engage_Bar' has no member named 'tray'
tray.c:42: error: 'Engage_Bar' has no member named 'tray'
tray.c:42: error: 'Engage_Bar' has no member named 'tray'
tray.c:42: error: 'Engage_Bar' has no member named 'tray'
tray.c:43: error: 'Engage_Bar' has no member named 'tray'
tray.c:44: error: 'Engage_Bar' has no member named 'tray'
tray.c:47: error: 'Engage_Bar' has no member named 'tray'
tray.c:48: error: 'Engage_Bar' has no member named 'conf'
tray.c: In function '_engage_tray_shutdown':
tray.c:56: error: 'Engage_Bar' has no member named 'tray'
tray.c:59: error: 'Engage_Bar' has no member named 'tray'
tray.c:60: error: 'Engage_Bar' has no member named 'tray'
tray.c:61: error: 'Engage_Bar' has no member named 'tray'
tray.c:62: error: 'Engage_Bar' has no member named 'tray'
tray.c: In function '_engage_tray_active_set':
tray.c:81: error: 'Engage_Bar' has no member named 'tray'
tray.c:85: error: 'Engage_Bar' has no member named 'tray'
tray.c:104: error: 'Engage_Bar' has no member named 'tray'
tray.c:107: error: 'Engage_Bar' has no member named 'tray'
tray.c:108: error: 'Engage_Bar' has no member named 'tray'
tray.c:109: error: 'Engage_Bar' has no member named 'tray'
tray.c:111: error: 'Engage_Bar' has no member named 'tray'
tray.c:112: error: 'Engage_Bar' has no member named 'tray'
tray.c:116: error: 'Engage_Bar' has no member named 'tray'
tray.c:117: error: 'Engage_Bar' has no member named 'tray'
tray.c:118: error: 'Engage_Bar' has no member named 'tray'
tray.c:119: error: 'Engage_Bar' has no member named 'tray'
tray.c:120: error: 'Engage_Bar' has no member named 'tray'
tray.c:121: error: 'Engage_Bar' has no member named 'tray'
tray.c: In function '_engage_tray_freeze':
tray.c:128: error: 'Engage_Bar' has no member named 'tray'
tray.c:130: error: 'Engage_Bar' has no member named 'tray'
tray.c:131: error: 'Engage_Bar' has no member named 'tray'
tray.c: In function '_engage_tray_thaw':
tray.c:137: error: 'Engage_Bar' has no member named 'tray'
tray.c:139: error: 'Engage_Bar' has no member named 'tray'
tray.c:140: error: 'Engage_Bar' has no member named 'tray'
tray.c: In function '_engage_tray_add':
tray.c:147: error: 'Engage_Bar' has no member named 'conf'
tray.c:150: error: 'Engage_Bar' has no member named 'tray'
tray.c:152: error: 'Engage_Bar' has no member named 'tray'
tray.c:155: error: 'Engage_Bar' has no member named 'tray'
tray.c:155: error: 'Engage_Bar' has no member named 'tray'
tray.c:156: error: 'Engage_Bar' has no member named 'tray'
tray.c:160: error: 'Engage_Bar' has no member named 'tray'
tray.c: In function '_engage_tray_remove':
tray.c:171: error: 'Engage_Bar' has no member named 'conf'
tray.c:176: error: 'Engage_Bar' has no member named 'tray'
tray.c:179: error: 'Engage_Bar' has no member named 'tray'
tray.c:179: error: 'Engage_Bar' has no member named 'tray'
tray.c:180: error: 'Engage_Bar' has no member named 'tray'
tray.c:183: error: 'Engage_Bar' has no member named 'tray'
tray.c:184: error: 'Engage_Bar' has no member named 'tray'
tray.c: In function '_engage_tray_cb_msg':
tray.c:195: error: 'Engage_Bar' has no member named 'conf'
tray.c: In function '_engage_tray_cb_move':
tray.c:227: error: 'Engage_Bar' has no member named 'conf'
tray.c:228: error: 'Engage_Bar' has no member named 'tray'
tray.c: In function '_engage_tray_layout':
tray.c:248: error: 'E_Gadman_Edge' undeclared (first use in this function)
tray.c:248: error: (Each undeclared identifier is reported only once
tray.c:248: error: for each function it appears in.)
tray.c:248: error: expected ';' before 'edge'
tray.c:250: error: 'Engage_Bar' has no member named 'gmc'
tray.c:250: error: 'Engage_Bar' has no member named 'conf'
tray.c:250: error: 'Engage_Bar' has no member named 'tray'
tray.c:253: error: 'edge' undeclared (first use in this function)
tray.c:253: warning: implicit declaration of function 'e_gadman_client_edge_get'
tray.c:253: error: 'Engage_Bar' has no member named 'gmc'
tray.c:254: error: 'Engage_Bar' has no member named 'conf'
tray.c:258: error: 'E_GADMAN_EDGE_BOTTOM' undeclared (first use in this function
)
tray.c:258: error: 'E_GADMAN_EDGE_TOP' undeclared (first use in this function)
tray.c:261: error: 'Engage_Bar' has no member named 'conf'
tray.c:265: error: 'Engage_Bar' has no member named 'conf'
tray.c:268: error: 'Engage_Bar' has no member named 'tray'
tray.c:269: error: 'Engage_Bar' has no member named 'tray'
tray.c:271: error: 'Engage_Bar' has no member named 'tray'
tray.c:272: error: 'Engage_Bar' has no member named 'tray'
tray.c:273: error: 'Engage_Bar' has no member named 'tray'
tray.c:277: error: 'Engage_Bar' has no member named 'conf'
tray.c:281: error: 'Engage_Bar' has no member named 'tray'
tray.c:282: error: 'Engage_Bar' has no member named 'tray'
tray.c:287: error: 'Engage_Bar' has no member named 'tray'
tray.c:289: error: 'Engage_Bar' has no member named 'tray'
tray.c:290: error: 'Engage_Bar' has no member named 'tray'
tray.c:292: error: 'Engage_Bar' has no member named 'tray'
tray.c:293: error: 'Engage_Bar' has no member named 'tray'
tray.c:295: error: 'Engage_Bar' has no member named 'tray'
tray.c:296: error: 'Engage_Bar' has no member named 'tray'
tray.c:298: error: 'Engage_Bar' has no member named 'tray'
tray.c:299: error: 'Engage_Bar' has no member named 'tray'
tray.c:302: error: 'Engage_Bar' has no member named 'tray'
tray.c:305: error: 'E_GADMAN_EDGE_RIGHT' undeclared (first use in this function)
tray.c:310: error: 'Engage_Bar' has no member named 'tray'
make[3]: *** [tray.lo] Error 1
make[2]: *** [all-recursive] Error 1
make[1]: *** [all-recursive] Error 1
make: *** [all] Error 2
error: Bad exit status from /var/tmp/rpm-tmp.6249 (%build)
    Bad exit status from /var/tmp/rpm-tmp.6249 (%build)
aborting... engage.spec did not compile!
Compilation Failure!