[Date Prev][Date Next][Thread Prev][Thread Next][Date Index][Thread Index]

Re: [E-devel] CVS E17 doesn't compile



On Sat, 19 Aug 2006 16:15:13 +0800 "Didier Casse" <didier.casse@gmail.com>
babbled:

my guess - your ecore is not up to date

> Please see below: (complete log attached)
> 
> *snip*
> + ./configure --build=i686-redhat-linux-gnu
> --host=i686-redhat-linux-gnu --target=i386-redhat-linux-gnu
> --program-prefix= --prefix=/usr --exec-prefix=/usr --bindir=/usr/bin
> --sbindir=/usr/sbin --sysconfdir=/etc --datadir=/usr/share
> --includedir=/usr/include --libdir=/usr/lib --libexecdir=/usr/libexec
> --localstatedir=/var --sharedstatedir=/usr/com --mandir=/usr/share/man
> --infodir=/usr/share/info
> configure: WARNING: Cannot find CoreFoundation headers and libraries.
> /bin/sh: ./config.rpath: No such file or directory
> + /usr/bin/make -j3
> e_main.c: In function 'main':
> e_main.c:376: error: wrong type argument to unary exclamation mark
> e_main.c:382: warning: passing argument 1 of '_e_main_shutdown_push'
> from incompatible pointer type
> e_main.c: In function '_e_main_dirs_init':
> e_main.c:875: warning: ignoring return value of 'system', declared
> with attribute warn_unused_result
> e_main.c:886: warning: ignoring return value of 'system', declared
> with attribute warn_unused_result
> make[3]: *** [e_main.o] Error 1
> make[3]: *** Waiting for unfinished jobs....
> make[2]: *** [all-recursive] Error 1
> make[1]: *** [all-recursive] Error 1
> make: *** [all] Error 2
> error: Bad exit status from /var/tmp/rpm-tmp.17477 (%build)
>     Bad exit status from /var/tmp/rpm-tmp.17477 (%build)
> aborting... enlightenment.spec did not compile!
> Compilation Failure!
> 
> 
> -- 
> With kind regards,
> Didier.
> 
> ------------
> Yum/apt repository for DR17/EFL: http://sps.nus.edu.sg/~didierbe
> 


-- 
------------- Codito, ergo sum - "I code, therefore I am" --------------
The Rasterman (Carsten Haitzler)    raster@rasterman.com
裸好多
Tokyo, Japan (東京 日本)