[Date Prev][Date Next][Thread Prev][Thread Next][Date Index][Thread Index]

[E-devel] ecore compilation failed



trying to build the latest cvs I get this error when compiling ecore:

ecore_fb_li.c: In function `ecore_fb_input_device_open':
ecore_fb_li.c:385: error: `EV_SYN' undeclared (first use in this
function)
ecore_fb_li.c:385: error: (Each undeclared identifier is reported
only once
ecore_fb_li.c:385: error: for each function it appears in.)
ecore_fb_li.c:405: error: `EV_FF_STATUS' undeclared (first use in
this function)
ecore_fb_li.c:406: error: `EV_PWR' undeclared (first use in this
function)
ecore_fb_li.c: In function `ecore_fb_input_device_axis_size_set':
ecore_fb_li.c:454: error: storage size of `abs_features' isn't known
make[4]: *** [ecore_fb_li.lo] Error 1

where those EV_* should be defined? am I missing something?

-- 
       Massimo Maiurana         massimo<at>ragusa.linux.it
       http://massimo.solira.org       GPG keyID #7044D601

Articolo 11 - L'Italia ripudia la guerra come strumento di offesa
alla libertà degli altri popoli e come mezzo di risoluzione delle
controversie internazionali....

Attachment: signature.asc
Description: OpenPGP digital signature