[Date Prev][Date Next][Thread Prev][Thread Next][Date Index][Thread Index]

Re: [E-devel] Ecore does not compile.



I still can't compile Ecore on FreeBSD:-(

8<----------------------------------------------------------------------
so ../../src/lib/ecore_job/.libs/libecore_job.so ../../src/lib/ecore_evas/.libs/libecore_evas.so /usr/devel/enlightenment/e17/libs/ecore/src/lib/ecore_x/.libs/libecore_x.so
-lXcursor -lXrender -lXp -lXinerama -lXrandr -lXfixes -lXdamage -lXss
-lX11
-lXext /usr/devel/enlightenment/e17/libs/ecore/src/lib/ecore_txt/.libs/libecore_txt.so /usr/devel/enlightenment/e17/libs/ecore/src/lib/ecore_job/.libs/libecore_job.so /usr/devel/enlightenment/current/lib/libevas.so /usr/devel/enlightenment/current/lib/libeet.so /usr/local/lib/libjpeg.so /usr/X11R6/lib/libfontconfig.so /usr/local/lib/libfreetype.so /usr/local/lib/libexpat.so ../../src/lib/ecore_con/.libs/libecore_con.so ../../src/lib/ecore_ipc/.libs/libecore_ipc.so /usr/devel/enlightenment/e17/libs/ecore/src/lib/ecore_con/.libs/libecore_con.so /usr/devel/enlightenment/e17/libs/ecore/src/lib/ecore/.libs/libecore.so
-lcurl /usr/local/lib/libidn.so /usr/local/lib/libiconv.so -lssl
-lcrypto -lz -lm -Wl,--rpath -Wl,/usr/devel/enlightenment/current/lib
-Wl,--rpath -Wl,/usr/local/lib -Wl,--rpath -Wl,/usr/X11R6/lib gcc: yes:
No such file or directory gmake[3]: *** [ecore_test] Error 1 gmake[3]:
Leaving directory `/usr/devel/enlightenment/e17/libs/ecore/src/bin'
gmake[2]: *** [all-recursive] Error 1 gmake[2]: Leaving directory
`/usr/devel/enlightenment/e17/libs/ecore/src' gmake[1]: ***
[all-recursive] Error 1 gmake[1]: Leaving directory
`/usr/devel/enlightenment/e17/libs/ecore' gmake: *** [all] Error 2
8<----------------------------------------------------------------------

Any ideas out there?

\\troback

On Sat, 20 May 2006 03:16:58 +0200
Francisco Sanz <frasanz@unizar.es> wrote:

> Now it's ok
> 
> thanks.
> 
> 
> El vie, 19-05-2006 a las 09:25 -0500, Ibukun Olumuyiwa escribió:
> > Francisco Sanz wrote:
> > > Hello.
> > > 
> > > I have a problem compiling ecore.
> > > 
> > > There is not all archives in  ecore/src/lib/ecore_x
> > > 
> > > i.e. there is not ecore_x_fixes.c
> > > 
> > > I downlad ecore from cvs today.
> > > 
> > 
> > My error - forgot to add the new files to CVS. Update and try again.
> > 
> 
> 
> 
> -------------------------------------------------------
> Using Tomcat but need to do more? Need to support web services,
> security? Get stuff done quickly with pre-integrated technology to
> make your job easier Download IBM WebSphere Application Server
> v.1.0.1 based on Apache Geronimo
> http://sel.as-us.falkag.net/sel?cmd=lnk&kid0709&bid&3057&dat1642
> _______________________________________________ enlightenment-devel
> mailing list enlightenment-devel@lists.sourceforge.net
> https://lists.sourceforge.net/lists/listinfo/enlightenment-devel



-- 

============================================
Microsoft is not the answer.
Microsoft is the question.
And 'No' is the answer!
--------------------------------------------
http://www.troback.com
-