[Date Prev][Date Next][Thread Prev][Thread Next][Date Index][Thread Index]

[E-devel] Error building...



Hi,

having some problems lately when I'm compiling e17/apps/e and
e17/libs/ecore on FreeBSD. 

I think this means that I have the wrong ecore version...this is e:
8<---------------------
e rm -f ".deps/e_int_config_display.Tpo"; exit 1; fi
e_int_config_display.c:49: error: syntax error before
"Ecore_X_Randr_Rotation" e_int_config_display.c: In function
`_fill_data': e_int_config_display.c:200: error: syntax error before
"rots" e_int_config_display.c:207: error: `rots' undeclared (first use
in this function )
e_int_config_display.c:207: error: (Each undeclared identifier is
reported only once
e_int_config_display.c:207: error: for each function it appears in.)
e_int_config_display.c:210: error: structure has no member named
`rotation' e_int_config_display.c:211: error: `ECORE_X_RANDR_FLIP_X'
undeclared (first use in this function)
e_int_config_display.c:211: error: `ECORE_X_RANDR_FLIP_Y' undeclared
(first use in this function)
e_int_config_display.c:212: error: structure has no member named `flip'
e_int_config_display.c:212: error: structure has no member named
`rotation' e_int_config_display.c:216: error: `ECORE_X_RANDR_ROT_0'
undeclared (first use i n this function)
e_int_config_display.c:216: error: `ECORE_X_RANDR_ROT_90' undeclared
(first use in this function)
e_int_config_display.c:217: error: `ECORE_X_RANDR_ROT_180' undeclared
(first use in this function)
e_int_config_display.c:217: error: `ECORE_X_RANDR_ROT_270' undeclared
(first use in this function)
e_int_config_display.c:218: error: structure has no member named
`rotation' e_int_config_display.c:219: error: structure has no member
named `rotation' e_int_config_display.c: In function
`_basic_apply_data': e_int_config_display.c:302: error: syntax error
before "rot" e_int_config_display.c:304: error: `rot' undeclared (first
use in this function) e_int_config_display.c:305: error: structure has
no member named `rotation' e_int_config_display.c:305: error: structure
has no member named `flip' e_int_config_display.c:307: error: structure
has no member named `rotation' e_int_config_display.c:307: error:
structure has no member named `flip' e_int_config_display.c:308: error:
structure has no member named `rotation' e_int_config_display.c:308:
error: structure has no member named `flip' e_int_config_display.c: In
function `_basic_create_widgets': e_int_config_display.c:439: error:
structure has no member named `rotation' e_int_config_display.c:441:
error: `ECORE_X_RANDR_ROT_0' undeclared (first use i n this function)
e_int_config_display.c:444: error: `ECORE_X_RANDR_ROT_90' undeclared
(first use in this function)
e_int_config_display.c:447: error: `ECORE_X_RANDR_ROT_180' undeclared
(first use in this function)
e_int_config_display.c:450: error: `ECORE_X_RANDR_ROT_270' undeclared
(first use in this function)
e_int_config_display.c:461: error: structure has no member named `flip'
e_int_config_display.c:463: error: `ECORE_X_RANDR_FLIP_X' undeclared
(first use in this function)
e_int_config_display.c:466: error: `ECORE_X_RANDR_FLIP_Y' undeclared
(first use in this function)
gmake[3]: *** [e_int_config_display.o] Error 1
gmake[3]: Leaving directory
`/usr/devel/enlightenment/e17/apps/e/src/bin' gmake[2]: ***
[all-recursive] Error 1 gmake[2]: Leaving directory
`/usr/devel/enlightenment/e17/apps/e/src'
8<---------------------


This is ecore:
8<---------------------
ent/e17/libs/ecore/src/lib/ecore_con/.libs/libecore_con.so /usr/devel/enlightenment/e17/libs/ecore/src/lib/ecore/.libs/libecore.so
-lcurl /usr/local/lib/libidn.so /usr/local/lib/libiconv.so -lssl
-lcrypto -lz -lm -Wl,--rpath -Wl,/usr/devel/enlightenment/current/lib
-Wl,--rpath -Wl,/usr/local/lib -Wl,--rpath -Wl,/usr/X11R6/lib gcc: yes:
No such file or directory gmake[3]: *** [ecore_test] Error 1 gmake[3]:
Leaving directory `/usr/devel/enlightenment/e17/libs/ecore/src/bin'
gmake[2]: *** [all-recursive] Error 1 gmake[2]: Leaving directory
`/usr/devel/enlightenment/e17/libs/ecore/src' gmake[1]: ***
[all-recursive] Error 1 gmake[1]: Leaving directory
`/usr/devel/enlightenment/e17/libs/ecore' gmake: *** [all] Error 2
8<---------------------


Thanks for your time!!!


Regards
Anders Troback
Sweden
-- 

============================================
Microsoft is not the answer.
Microsoft is the question.
And 'No' is the answer!
--------------------------------------------
http://www.troback.com
-