[Date Prev][Date Next][Thread Prev][Thread Next][Date Index][Thread Index]

Re: [E-devel] Build evfs on FreeBSD...



Hi,
My fault - will fix.

Cheers,
Alex.

On Thu, 2006-04-27 at 16:06 +0200, Anders Troback wrote:
> I tire to maintain a script that builds e17 from cvs on FreeBSD, for
> some time now the evfs wont build, I get this:
> 
>  gcc -DHAVE_CONFIG_H -I. -I. -I../../.. -I. -I../../..
> -I../../../src/include -I /usr/devel/enlightenment/current/include
> -I/usr/include -I/usr/local/include -I/ usr/X11R6/include
> -I/usr/devel/enlightenment/current/include -I/usr/devel/enligh
> tenment/current/include -D_FILE_OFFSET_BITS=64 -MT
> samba_la-evfs_fs_samba.lo -MD -MP -MF .deps/samba_la-evfs_fs_samba.Tpo
> -c evfs_fs_samba.c  -fPIC -DPIC -o .li bs/samba_la-evfs_fs_samba.o
> evfs_fs_samba.c: In function `auth_fn': evfs_fs_samba.c:143: error:
> `PATH_MAX' undeclared (first use in this function) evfs_fs_samba.c:143:
> error: (Each undeclared identifier is reported only once
> evfs_fs_samba.c:143: error: for each function it appears in.)
> evfs_fs_samba.c: In function `smb_evfs_file_stat': evfs_fs_samba.c:247:
> error: `PATH_MAX' undeclared (first use in this function)
> evfs_fs_samba.c: In function `smb_evfs_dir_list': evfs_fs_samba.c:301:
> error: `PATH_MAX' undeclared (first use in this function)
> evfs_fs_samba.c: In function `evfs_file_remove': evfs_fs_samba.c:415:
> error: `PATH_MAX' undeclared (first use in this function) gmake[4]: ***
> [samba_la-evfs_fs_samba.lo] Error 1 gmake[4]: Leaving directory
> `/usr/devel/enlightenment/e17/apps/evfs/src/plugins/ file'
> gmake[3]: *** [all-recursive] Error 1
> gmake[3]: Leaving directory
> `/usr/devel/enlightenment/e17/apps/evfs/src/plugins' gmake[2]: ***
> [all-recursive] Error 1 gmake[2]: Leaving directory
> `/usr/devel/enlightenment/e17/apps/evfs/src' gmake[1]: ***
> [all-recursive] Error 1 gmake[1]: Leaving directory
> `/usr/devel/enlightenment/e17/apps/evfs' gmake: *** [all] Error 2
> 
> Any ides why evfs don't build?
> 
> Thanks!
> 
> \\troback
>