[Date Prev][Date Next][Thread Prev][Thread Next][Date Index][Thread Index]

[E-devel] error in compilation process



libecore_directfb.so not build by default.

,----[emotion
| (cd .libs && rm -f emotion_decoder_xine.la && ln -s ../emotion_decoder_xine.la emotion_decoder_xine.la)
| make[5]: Leaving directory `/root/CVS/e17/libs/emotion/src/modules'
| make[5]: Entering directory `/root/CVS/e17/libs/emotion/src'
| make[5]: Nothing to be done for `all-am'.
| make[5]: Leaving directory `/root/CVS/e17/libs/emotion/src'
| make[4]: Leaving directory `/root/CVS/e17/libs/emotion/src'
| Making all in data
| make[4]: Entering directory `/root/CVS/e17/libs/emotion/data'
| edje_cc -v -id ../data -fd ../data \
|         ../data/theme.edc \
|         ../data/theme.edj
| edje_cc: error while loading shared libraries: libecore_directfb.so.1: cannot open shared object file: No such file or directory
| make[4]: Leaving directory `/root/CVS/e17/libs/emotion/data'
| make[4]: *** [theme.edj] Error 127
| make[3]: make[3]: Leaving directory `/root/CVS/e17/libs/emotion'
| *** [all-recursive] Error 1
| make[2]: *** [all] Error 2make[2]: Leaving directory `/root/CVS/e17/libs/emotion'
| 
| make[1]: *** [build-stamp] Error 2
| make[1]: Leaving directory `/root/CVS/e17/libs/emotion'
| dpkg: error processing ../*.deb (--install):
|  cannot access archive: No such file or directory
| Errors were encountered while processing:
|  ../*.deb
| rm: cannot remove `../*.changes': No such file or directory
| mv: cannot stat `../*.deb': No such file or directory
| make: *** [emotion] Error 1
`----

-- 
Vlad Alyukov
RT QA Engineer
SWsoft, Inc.