[Date Prev][Date Next][Thread Prev][Thread Next][Date Index][Thread Index]

[E-devel] Problems compiling Eterm in current CVS



Eterm screams! (Full log as an attachment)

cp: omitting directory `./Eterm/CVS'
cp: omitting directory `./auto/CVS'
cp: omitting directory `./Escreen/CVS'
cp: omitting directory `./trans/CVS'
make[3]: execvp: ../utils/Etbg_update_list: Permission denied
make[3]: *** [install-data-hook] Error 127
make[2]: *** [install-data-am] Error 2
make[1]: *** [install-am] Error 2
make: *** [install-recursive] Error 1
error: Bad exit status from /var/tmp/rpm-tmp.67693 (%install)
    Bad exit status from /var/tmp/rpm-tmp.67693 (%install)

Please advise. Thanks

--
With kind regards,
Didier.

------------
Yum/apt repository for DR17/EFL: http://sps.nus.edu.sg/~didierbe

Didier F.B Casse
PhD candidate, Singapore Synchrotron Light Source (SSLS)
National University of Singapore.
+ umask 022
+ cd /home/didier/rpmbuild/BUILD
+ LANG=C
+ export LANG
+ unset DISPLAY
+ cd /home/didier/rpmbuild/BUILD
+ rm -rf Eterm-0.9.4
+ /usr/bin/gzip -dc /home/didier/rpmbuild/SOURCES/Eterm-0.9.4-20060402.tar.gz
+ tar -xvvf -
+ STATUS=0
+ '[' 0 -ne 0 ']'
+ cd Eterm-0.9.4
+ tar -xvvf -
+ /usr/bin/gzip -dc /home/didier/rpmbuild/SOURCES/Eterm-bg-0.9.4.tar.gz
+ STATUS=0
+ '[' 0 -ne 0 ']'
++ /usr/bin/id -u
+ '[' 500 = 0 ']'
++ /usr/bin/id -u
+ '[' 500 = 0 ']'
+ /bin/chmod -Rf a+rX,u+w,g-w,o-w .
+ exit 0
+ umask 022
+ cd /home/didier/rpmbuild/BUILD
+ cd Eterm-0.9.4
+ LANG=C
+ export LANG
+ unset DISPLAY
+ rm -rf missing
+ touch README
+ aclocal
/usr/share/aclocal/speex.m4:10: warning: underquoted definition of XIPH_PATH_SPE       
EX
  run info '(automake)Extending aclocal'
  or see http://sources.redhat.com/automake/automake.html#Extending-aclocal
/usr/share/aclocal/nspr.m4:8: warning: underquoted definition of AM_PATH_NSPR
/usr/share/aclocal/linc.m4:1: warning: underquoted definition of AM_PATH_LINC
/usr/share/aclocal/librsvg.m4:11: warning: underquoted definition of AM_PATH_LIB       
RSVG
/usr/share/aclocal/libole2.m4:18: warning: underquoted definition of AM_PATH_LIB       
OLE2
/usr/share/aclocal/aalib.m4:12: warning: underquoted definition of AM_PATH_AALIB
configure.in:122: warning: AC_CANONICAL_HOST invoked multiple times
autoconf/specific.m4:363: AC_CYGWIN is expanded from...
configure.in:122: the top level
configure.in:123: warning: AC_ARG_PROGRAM invoked multiple times
+ autoheader
configure.in:122: warning: AC_CANONICAL_HOST invoked multiple times
autoconf/specific.m4:363: AC_CYGWIN is expanded from...
configure.in:122: the top level
configure.in:123: warning: AC_ARG_PROGRAM invoked multiple times
+ autoconf
configure.in:122: warning: AC_CANONICAL_HOST invoked multiple times
autoconf/specific.m4:363: AC_CYGWIN is expanded from...
configure.in:122: the top level
configure.in:123: warning: AC_ARG_PROGRAM invoked multiple times
+ libtoolize --copy --automake
+ automake --add-missing --copy --gnu
configure.in:122: warning: AC_CANONICAL_HOST invoked multiple times
autoconf/specific.m4:363: AC_CYGWIN is expanded from...
configure.in:122: the top level
configure.in:123: warning: AC_ARG_PROGRAM invoked multiple times
configure.in: installing `./install-sh'
configure.in: installing `./missing'
src/Makefile.am: installing `./depcomp'
+ CFLAGS='-O0 -g3'
+ export CFLAGS
+ CFLAGS='-O0 -g3'
+ export CFLAGS
+ CXXFLAGS='-O2 -g -pipe -m32 -march=i386 -mtune=pentium4'
+ export CXXFLAGS
+ FFLAGS='-O2 -g -pipe -m32 -march=i386 -mtune=pentium4'
+ export FFLAGS
++ find . -name config.guess -o -name config.sub
+ for i in '$(find . -name config.guess -o -name config.sub)'
++ basename ./config.guess
+ '[' -f /usr/lib/rpm/redhat/config.guess ']'
+ /bin/rm -f ./config.guess
++ basename ./config.guess
+ /bin/cp -fv /usr/lib/rpm/redhat/config.guess ./config.guess
+ for i in '$(find . -name config.guess -o -name config.sub)'
++ basename ./config.sub
+ '[' -f /usr/lib/rpm/redhat/config.sub ']'
+ /bin/rm -f ./config.sub
++ basename ./config.sub
+ /bin/cp -fv /usr/lib/rpm/redhat/config.sub ./config.sub
+ ./configure --build=i686-redhat-linux-gnu --host=i686-redhat-linux-gnu --targe       
t=i386-redhat-linux-gnu --program-prefix= --prefix=/usr --exec-prefix=/usr --bin       
dir=/usr/bin --sbindir=/usr/sbin --sysconfdir=/etc --datadir=/usr/share --includ       
edir=/usr/include --libdir=/usr/lib --libexecdir=/usr/libexec --localstatedir=/v       
ar --sharedstatedir=/usr/com --mandir=/usr/share/man --infodir=/usr/share/info -       
-enable-multi-charset --enable-escreen --enable-auto-encoding --with-debugging=9       
 --disable-default-rpaths
configure: WARNING: regexp.h: present but cannot be compiled
configure: WARNING: regexp.h:     check for missing prerequisite headers?
configure: WARNING: regexp.h: see the Autoconf documentation
configure: WARNING: regexp.h:     section "Present But Cannot Be Compiled"
configure: WARNING: regexp.h: proceeding with the preprocessor's result
configure: WARNING: regexp.h: in the future, the compiler will take precedence
configure: WARNING:     ## ------------------------------------------ ##
configure: WARNING:     ## Report this to the AC_PACKAGE_NAME lists.  ##
configure: WARNING:     ## ------------------------------------------ ##
+ /usr/bin/make -j3
libscream.c:1438:2: warning: #warning compiling in libscream
libscream.c:1443:2: warning: #warning compiling in support for GNU screen
mkdir: cannot create directory `.libs': File exists
+ exit 0
+ umask 022
+ cd /home/didier/rpmbuild/BUILD
+ cd Eterm-0.9.4
+ LANG=C
+ export LANG
+ unset DISPLAY
+ rm -rf /var/tmp/Eterm-0.9.4-1.20060402cvs-root-didier
+ /usr/bin/make DESTDIR=/var/tmp/Eterm-0.9.4-1.20060402cvs-root-didier install
libtool: install: warning: remember to run `libtool --finish /usr/lib'
cp: omitting directory `./Eterm/CVS'
cp: omitting directory `./auto/CVS'
cp: omitting directory `./Escreen/CVS'
cp: omitting directory `./trans/CVS'
make[3]: execvp: ../utils/Etbg_update_list: Permission denied
make[3]: *** [install-data-hook] Error 127
make[2]: *** [install-data-am] Error 2
make[1]: *** [install-am] Error 2
make: *** [install-recursive] Error 1
error: Bad exit status from /var/tmp/rpm-tmp.67693 (%install)
    Bad exit status from /var/tmp/rpm-tmp.67693 (%install)
aborting... Eterm.spec did not compile!