[Date Prev][Date Next][Thread Prev][Thread Next][Date Index][Thread Index]

[E-devel] e17 cvs - entropy make error



got this after cvs update this date:

==============
.
.
.
E_DATA_DIR=\"/usr/local/share/entropy\" -DPACKAGE_SOURCE_DIR=\"/root/e17/proto/entropy\" -I. -I. -I. -I../.. -I../../src/include -I/usr/local/include -I/usr/local/include -I/usr/local/include -I/usr/l ocal/include -I/usr/local/include -I/usr/local/include -I/usr/local/include/etk -g -O2 -D_FILE_OFFSE T_BITS=64 -Wall -MT layout_etk_simple_la-etk_file_cache_debug_dialog.lo -MD -MP -MF .deps/layout_etk _simple_la-etk_file_cache_debug_dialog.Tpo -c ../../src/dialogs/etk_file_cache_debug_dialog.c -fPIC
-DPIC -o .libs/layout_etk_simple_la-etk_file_cache_debug_dialog.o
../../src/dialogs/etk_file_cache_debug_dialog.c: In function 'etk_file_cache_dialog_create': ../../src/dialogs/etk_file_cache_debug_dialog.c:106: warning: passing argument 3 of 'etk_tree_col_so
rt_func_set' makes pointer from integer without a cast
../../src/dialogs/etk_file_cache_debug_dialog.c:106: error: too many arguments to function 'etk_tree
_col_sort_func_set'
make[2]: *** [layout_etk_simple_la-etk_file_cache_debug_dialog.lo] Error 1
make[2]: Leaving directory `/root/e17/proto/entropy/src/plugins'
make[1]: *** [all-recursive] Error 1
make[1]: Leaving directory `/root/e17/proto/entropy/src'
make: *** [all-recursive] Error 1
==============

I had rebuilt all EFL & evfs prior to this build attempt.

Considering how flaky anon cvs has been lately maybe this is just a bad combo of files. Maybe it will heal itself (or maybe not).

running Fedora Core 4 system with:

gcc (GCC) 4.0.2 20051125 (Red Hat 4.0.2-8)